{"text_format":"3","workbook":"xlsx","n_sheets":14,"sheets":["Consolidation","SysX.ch Pers.","SysX.ch Equip. ","SystX.ch Cons.","SystX.ch Misc","OC Pers."," OC Equip. & E.I.","OC Cons.","OC Misc","2nd Party Pers.","2nd Party Equip. & Cons. & Misc","3rd Party Pers.","3rd Party Equip. & Cons. & Misc","Tables"],"not_rendered":{"images":3,"defined_names":33,"comments":10},"read":"whole","date_system":"1900"}

{"sheet":"Consolidation","index":0,"n_rows":39,"n_cols":6,"rows_kept":39,"merged":[[0,1,0,4],[4,5,5,6],[16,5,16,6],[17,6,18,6],[19,6,20,6],[21,6,22,6],[24,5,24,6],[25,6,26,6],[27,6,28,6],[29,6,30,6],[32,5,32,6],[33,6,34,6],[35,6,36,6],[37,6,38,6]]}
[null,"Please fill out one reporting file per project and institution"]
[null,"MRD-Project - Financial Report 2017"]
[]
[null,"General Information:"]
[{"$nulls":4},"Project Title: "]
[null,"Institution"]
[]
[]
[null,"F&C Contact"]
[null,"Surname:",null,null,"Reporting period:"]
[null,"First Name:"]
[null,"Address:",null,null,"Your int.ref.:"]
[]
[{"$nulls":4},"SysX.ch int.ref.:"]
[null,"Phone:"]
[null,"E-Mail:"]
[{"$nulls":5},"Confirmation: Grant recipient / account holder at your institution"]
[]
[{"$nulls":5},"Place, date:"]
[null,"Total for whole project:","Year 2017 in CHF"]
{"$rows_left_out":20}
{"sheet":"SysX.ch Pers.","index":1,"n_rows":191,"n_cols":13,"rows_kept":191,"merged":[[1,4,1,7],[2,0,2,2],[3,0,3,6]]}
[]
["SystemsX.ch Funds",null,null,"Project Titel:",{"$f":"Consolidation!F5","v":0}]
["Personnel",null,null,"SystX.ch int.ref.:",{"$f":"Consolidation!F14","v":0}]
["Please provide details for ALL personnel involved in the project paid with SystemsX.ch, and not simply totals per group"]
[]
[null,{"$f":"L191","v":0}]
["Project","Institution","Research Group","Funding Category","Cost Type","Name ","Internal Reference/ Personnel Number","Function (of the Personnel)","Base Salary / Cost 2017","% for SysX.ch  2017","Number of months employed","Total CHF 2017","Comments"]
[{"$f":"E2","v":0},null,null,"SystemsX.ch","Personnel",{"$nulls":6},{"$f":"I8*J8/12*K8","v":0}]
[{"$f":"A8","v":0},null,null,"SystemsX.ch","Personnel",{"$nulls":6},0]
[{"$f":"A9","v":0},null,null,"SystemsX.ch","Personnel",{"$nulls":6},0]
[0,null,null,"SystemsX.ch","Personnel",{"$nulls":6},{"$f":"I11*J11/12*K11","v":0}]
[0,null,null,"SystemsX.ch","Personnel",{"$nulls":6},0]
[0,null,null,"SystemsX.ch","Personnel",{"$nulls":6},0]
[0,null,null,"SystemsX.ch","Personnel",{"$nulls":6},0]
[0,null,null,"SystemsX.ch","Personnel",{"$nulls":6},0]
[0,null,null,"SystemsX.ch","Personnel",{"$nulls":6},0]
[0,null,null,"SystemsX.ch","Personnel",{"$nulls":6},0]
[0,null,null,"SystemsX.ch","Personnel",{"$nulls":6},0]
[0,null,null,"SystemsX.ch","Personnel",{"$nulls":6},0]
[0,null,null,"SystemsX.ch","Personnel",{"$nulls":6},0]
{"$rows_left_out":172}
{"sheet":"SysX.ch Equip. ","index":2,"n_rows":65,"n_cols":10,"rows_kept":65,"merged":[[1,4,1,6],[2,0,2,2],[3,0,3,6]]}
[]
["SystemsX.ch Funds",null,null,"Project Titel:",{"$f":"Consolidation!F5","v":0}]
["Equipment",null,null,"SystX.ch int.ref.:",{"$f":"Consolidation!F14","v":0}]
["Please provide all information per piece of equipment bought with SystemsX.ch Funds per research group."]
[]
[null,{"$f":"I65","v":{"v":0,"d":"0.00"}}]
["Project","Institution","Research Group","Funding Category","Cost Type","Description","Internal Reference","Purchase date","Total CHF 2017","Comments"]
[{"$f":"E2","v":0},null,null,"SystemsX.ch","Equipment"]
[{"$f":"A8","v":0},null,null,"SystemsX.ch","Equipment"]
[{"$f":"A9","v":0},null,null,"SystemsX.ch","Equipment"]
[0,null,null,"SystemsX.ch","Equipment"]
[0,null,null,"SystemsX.ch","Equipment"]
[0,null,null,"SystemsX.ch","Equipment"]
[0,null,null,"SystemsX.ch","Equipment"]
[0,null,null,"SystemsX.ch","Equipment"]
[0,null,null,"SystemsX.ch","Equipment"]
[0,null,null,"SystemsX.ch","Equipment"]
[0,null,null,"SystemsX.ch","Equipment"]
[0,null,null,"SystemsX.ch","Equipment"]
[0,null,null,"SystemsX.ch","Equipment"]
{"$rows_left_out":46}
{"sheet":"SystX.ch Cons.","index":3,"n_rows":202,"n_cols":10,"rows_kept":202,"merged":[[1,4,1,6],[2,0,2,2],[3,0,3,16383]]}
[]
["SystemsX.ch Funds",null,null,"Project Titel:",{"$f":"Consolidation!F5","v":0}]
["Consumables",null,null,"SystX.ch int.ref.:",{"$f":"Consolidation!F14","v":0}]
["You may enter totals per FUNDING CATEGORY and RESEARCH GROUP, IF you submit the details as a separate Excel file. "]
[]
[null,{"$f":"I202","v":{"v":0,"d":"0.00"}}]
["Project","Institution","Research Group","Funding Category","Cost Type","Name / Description","Internal Reference","Purchase date","Total CHF 2017","Comments"]
[{"$f":"E2","v":0},null,null,"SystemsX.ch","Consumables"]
[{"$f":"A8","v":0},null,null,"SystemsX.ch","Consumables"]
[{"$f":"A9","v":0},null,null,"SystemsX.ch","Consumables"]
[0,null,null,"SystemsX.ch","Consumables"]
[0,null,null,"SystemsX.ch","Consumables"]
[0,null,null,"SystemsX.ch","Consumables"]
[0,null,null,"SystemsX.ch","Consumables"]
[0,null,null,"SystemsX.ch","Consumables"]
[0,null,null,"SystemsX.ch","Consumables"]
[0,null,null,"SystemsX.ch","Consumables"]
[0,null,null,"SystemsX.ch","Consumables"]
[0,null,null,"SystemsX.ch","Consumables"]
[0,null,null,"SystemsX.ch","Consumables"]
{"$rows_left_out":183}
{"sheet":"SystX.ch Misc","index":4,"n_rows":202,"n_cols":10,"rows_kept":202,"merged":[[1,4,1,6],[2,0,2,2],[3,0,3,16383]]}
[]
["SystemsX.ch Funds",null,null,"Project Titel:",{"$f":"Consolidation!F5","v":0}]
["Miscellaneous",null,null,"SystX.ch int.ref.:",{"$f":"Consolidation!F14","v":0}]
["You may enter totals per FUNDING CATEGORY and RESEARCH GROUP, IF you submit the details as a separate Excel file. "]
[]
[null,{"$f":"I202","v":{"v":0,"d":"0.00"}}]
["Project","Institution","Research Group","Funding Category","Cost Type","Name / Description","Internal Reference","Purchase date","Total CHF 2017","Comments"]
[{"$f":"E2","v":0},null,null,"SystemsX.ch","Miscellaneous"]
[{"$f":"A8","v":0},null,null,"SystemsX.ch","Miscellaneous"]
[{"$f":"A9","v":0},null,null,"SystemsX.ch","Miscellaneous"]
[0,null,null,"SystemsX.ch","Miscellaneous"]
[0,null,null,"SystemsX.ch","Miscellaneous"]
[0,null,null,"SystemsX.ch","Miscellaneous"]
[0,null,null,"SystemsX.ch","Miscellaneous"]
[0,null,null,"SystemsX.ch","Miscellaneous"]
[0,null,null,"SystemsX.ch","Miscellaneous"]
[0,null,null,"SystemsX.ch","Miscellaneous"]
[0,null,null,"SystemsX.ch","Miscellaneous"]
[0,null,null,"SystemsX.ch","Miscellaneous"]
[0,null,null,"SystemsX.ch","Miscellaneous"]
{"$rows_left_out":183}
{"sheet":"OC Pers.","index":5,"n_rows":111,"n_cols":13,"rows_kept":111,"merged":[[1,4,1,10],[2,0,2,1],[3,0,3,7]]}
[]
["Own Contribution",null,null,"Project Titel:",{"$f":"Consolidation!F5","v":0}]
["Personnel",null,null,"SystX.ch int.ref.:",{"$f":"Consolidation!F14","v":0}]
["Please provide information for ALL personnel involved in the project paid with institutional funds and not simply totals per group"]
[null,{"$f":"L111","v":{"v":0,"d":"0.00"}}]
["Project","Institution","Research Group","Funding Category","Cost Type","Name ","Internal Reference/\nPersonnel Number","Function (only Personnel)","% Year 2017","CHF 2017","Number of months employed","Total CHF  2017","Comments"]
[{"$f":"E2","v":0},null,null,"Own Contributions","Personnel",{"$nulls":3},{"$f":"IF(D7=\"\",0,IF(D7=\"Own Contributions\",\"0\",\"\"))","v":"0"},{"$f":"IF(H7=\"\",0,(VLOOKUP(H7,Tables!$A$2:$B$9,2,FALSE))*I7)","v":{"v":0,"d":"0.00"}},null,{"$f":"J7/12*K7","v":{"v":0,"d":"0.00"}}]
[{"$f":"A7","v":0},null,null,"Own Contributions","Personnel",{"$nulls":3},"0",{"$f":"IF(H8=\"\",0,(VLOOKUP(H8,Tables!$A$2:$B$9,2,FALSE))*I8)","v":{"v":0,"d":"0.00"}},null,{"$f":"J8/12*K8","v":{"v":0,"d":"0.00"}}]
[{"$f":"A8","v":0},null,null,"Own Contributions","Personnel",{"$nulls":3},"0",{"$f":"IF(H9=\"\",0,(VLOOKUP(H9,Tables!$A$2:$B$9,2,FALSE))*I9)","v":{"v":0,"d":"0.00"}},null,{"v":0,"d":"0.00"}]
[{"$f":"A9","v":0},null,null,"Own Contributions","Personnel",{"$nulls":3},"0",{"$f":"IF(H10=\"\",0,(VLOOKUP(H10,Tables!$A$2:$B$9,2,FALSE))*I10)","v":{"v":0,"d":"0.00"}},null,{"v":0,"d":"0.00"}]
[0,null,null,"Own Contributions","Personnel",{"$nulls":3},"0",{"$f":"IF(H11=\"\",0,(VLOOKUP(H11,Tables!$A$2:$B$9,2,FALSE))*I11)","v":{"v":0,"d":"0.00"}},null,{"v":0,"d":"0.00"}]
[0,null,null,"Own Contributions","Personnel",{"$nulls":3},"0",{"$f":"IF(H12=\"\",0,(VLOOKUP(H12,Tables!$A$2:$B$9,2,FALSE))*I12)","v":{"v":0,"d":"0.00"}},null,{"v":0,"d":"0.00"}]
[0,null,null,"Own Contributions","Personnel",{"$nulls":3},"0",{"$f":"IF(H13=\"\",0,(VLOOKUP(H13,Tables!$A$2:$B$9,2,FALSE))*I13)","v":{"v":0,"d":"0.00"}},null,{"v":0,"d":"0.00"}]
[0,null,null,"Own Contributions","Personnel",{"$nulls":3},"0",{"$f":"IF(H14=\"\",0,(VLOOKUP(H14,Tables!$A$2:$B$9,2,FALSE))*I14)","v":{"v":0,"d":"0.00"}},null,{"v":0,"d":"0.00"}]
[0,null,null,"Own Contributions","Personnel",{"$nulls":3},"0",{"$f":"IF(H15=\"\",0,(VLOOKUP(H15,Tables!$A$2:$B$9,2,FALSE))*I15)","v":{"v":0,"d":"0.00"}},null,{"v":0,"d":"0.00"}]
[0,null,null,"Own Contributions","Personnel",{"$nulls":3},"0",{"$f":"IF(H16=\"\",0,(VLOOKUP(H16,Tables!$A$2:$B$9,2,FALSE))*I16)","v":{"v":0,"d":"0.00"}},null,{"v":0,"d":"0.00"}]
[0,null,null,"Own Contributions","Personnel",{"$nulls":3},"0",{"$f":"IF(H17=\"\",0,(VLOOKUP(H17,Tables!$A$2:$B$9,2,FALSE))*I17)","v":{"v":0,"d":"0.00"}},null,{"v":0,"d":"0.00"}]
[0,null,null,"Own Contributions","Personnel",{"$nulls":3},"0",{"$f":"IF(H18=\"\",0,(VLOOKUP(H18,Tables!$A$2:$B$9,2,FALSE))*I18)","v":{"v":0,"d":"0.00"}},null,{"v":0,"d":"0.00"}]
[0,null,null,"Own Contributions","Personnel",{"$nulls":3},"0",{"$f":"IF(H19=\"\",0,(VLOOKUP(H19,Tables!$A$2:$B$9,2,FALSE))*I19)","v":{"v":0,"d":"0.00"}},null,{"v":0,"d":"0.00"}]
[0,null,null,"Own Contributions","Personnel",{"$nulls":3},"0",{"$f":"IF(H20=\"\",0,(VLOOKUP(H20,Tables!$A$2:$B$9,2,FALSE))*I20)","v":{"v":0,"d":"0.00"}},null,{"v":0,"d":"0.00"}]
{"$rows_left_out":92}
{"sheet":" OC Equip. & E.I.","index":6,"n_rows":108,"n_cols":12,"rows_kept":108,"merged":[[1,4,1,9],[2,0,2,2],[4,0,4,9]]}
[]
["Own Contribution",null,null,"Project Titel:",{"$f":"Consolidation!F5","v":0}]
["Equipment and Existing \nInfrastructure",null,null,"SystX.ch int.ref.:",{"$f":"Consolidation!F14","v":0}]
[]
["You may enter totals for purchased EQUIPMENT per RESEARCH GROUP, IF you submit the details as a separate Excel file. "]
[]
[null,{"$f":"K108","v":0}]
["Project","Institution","Research Group","Funding Category","Cost Type","Description","Internal Reference","Purchase date","Cost","% made available to SystemsX.ch","CHF  Total 2017","Comments"]
[{"$f":"E2","v":0},null,null,"Own Contributions",{"$nulls":6},{"$f":"SUM(I9*J9)","v":0}]
[{"$f":"E2","v":0},null,null,"Own Contributions",{"$nulls":6},{"$f":"SUM(I10*J10)","v":0}]
[{"$f":"A10","v":0},null,null,"Own Contributions",{"$nulls":6},0]
[0,null,null,"Own Contributions",{"$nulls":6},0]
[0,null,null,"Own Contributions",{"$nulls":6},0]
[0,null,null,"Own Contributions",{"$nulls":6},0]
[0,null,null,"Own Contributions",{"$nulls":6},0]
[0,null,null,"Own Contributions",{"$nulls":6},0]
[0,null,null,"Own Contributions",{"$nulls":6},0]
[0,null,null,"Own Contributions",{"$nulls":6},0]
[0,null,null,"Own Contributions",{"$nulls":6},0]
[0,null,null,"Own Contributions",{"$nulls":6},0]
{"$rows_left_out":89}
{"sheet":"OC Cons.","index":7,"n_rows":202,"n_cols":12,"rows_kept":202,"merged":[[1,4,1,8],[2,0,2,2],[3,0,3,9]]}
[]
["Own Contribution",null,null,"Project Titel:",{"$f":"Consolidation!F5","v":0}]
["Consumables",null,null,"SystX.ch int.ref.:",{"$f":"Consolidation!F14","v":0}]
["You may enter totals per FUNDING CATEGORY per RESEARCH GROUP, IF you submit the details as a separate Excel file. "]
[null,{"$f":"K202","v":0}]
["Project","Institution","Research Group","Funding Category","Cost Type","Description","Internal Reference","Purchase date","CHF 2017","% for SysX.ch  2017","Total CHF  2017","Comments"]
[{"$f":"E2","v":0},null,null,"Own Contributions","Consumables",{"$nulls":5},{"$f":"J7*I7","v":0}]
[{"$f":"A7","v":0},null,null,"Own Contributions","Consumables",{"$nulls":5},{"$f":"J8*I8","v":0}]
[{"$f":"A8","v":0},null,null,"Own Contributions","Consumables",{"$nulls":5},0]
[0,null,null,"Own Contributions","Consumables",{"$nulls":5},0]
[0,null,null,"Own Contributions","Consumables",{"$nulls":5},0]
[0,null,null,"Own Contributions","Consumables",{"$nulls":5},0]
[0,null,null,"Own Contributions","Consumables",{"$nulls":5},0]
[0,null,null,"Own Contributions","Consumables",{"$nulls":5},0]
[0,null,null,"Own Contributions","Consumables",{"$nulls":5},0]
[0,null,null,"Own Contributions","Consumables",{"$nulls":5},0]
[0,null,null,"Own Contributions","Consumables",{"$nulls":5},0]
[0,null,null,"Own Contributions","Consumables",{"$nulls":5},0]
[0,null,null,"Own Contributions","Consumables",{"$nulls":5},0]
[0,null,null,"Own Contributions","Consumables",{"$nulls":5},0]
{"$rows_left_out":183}
{"sheet":"OC Misc","index":8,"n_rows":202,"n_cols":12,"rows_kept":202,"merged":[[1,4,1,8],[2,0,2,2],[3,0,3,9]]}
[]
["Own Contribution",null,null,"Project Titel:",{"$f":"Consolidation!F5","v":0}]
["Miscellaneous",null,null,"SystX.ch int.ref.:",{"$f":"Consolidation!F14","v":0}]
["You may enter totals per FUNDING CATEGORY per RESEARCH GROUP, IF you submit the details as a separate Excel file. "]
[null,{"$f":"K202","v":0}]
["Project","Institution","Research Group","Funding Category","Cost Type","Description","Internal Reference","Purchase date","CHF 2017","% for SysX.ch  2017","Total CHF  2017","Comments"]
[{"$f":"E2","v":0},null,null,"Own Contributions","Miscellaneous",{"$nulls":5},{"$f":"J7*I7","v":0}]
[{"$f":"A7","v":0},null,null,"Own Contributions","Miscellaneous",{"$nulls":5},{"$f":"J8*I8","v":0}]
[{"$f":"A8","v":0},null,null,"Own Contributions","Miscellaneous",{"$nulls":5},0]
[0,null,null,"Own Contributions","Miscellaneous",{"$nulls":5},0]
[0,null,null,"Own Contributions","Miscellaneous",{"$nulls":5},0]
[0,null,null,"Own Contributions","Miscellaneous",{"$nulls":5},0]
[0,null,null,"Own Contributions","Miscellaneous",{"$nulls":5},0]
[0,null,null,"Own Contributions","Miscellaneous",{"$nulls":5},0]
[0,null,null,"Own Contributions","Miscellaneous",{"$nulls":5},0]
[0,null,null,"Own Contributions","Miscellaneous",{"$nulls":5},0]
[0,null,null,"Own Contributions","Miscellaneous",{"$nulls":5},0]
[0,null,null,"Own Contributions","Miscellaneous",{"$nulls":5},0]
[0,null,null,"Own Contributions","Miscellaneous",{"$nulls":5},0]
[0,null,null,"Own Contributions","Miscellaneous",{"$nulls":5},0]
{"$rows_left_out":183}
{"sheet":"2nd Party Pers.","index":9,"n_rows":31,"n_cols":13,"rows_kept":31,"merged":[[1,4,1,7],[2,0,2,2],[3,0,3,6]]}
[]
["Second-Party Funds",null,null,"Project Titel:",{"$f":"Consolidation!F5","v":0}]
["Personnel",null,null,"SystX.ch int.ref.:",{"$f":"Consolidation!F14","v":0}]
["Please provide details for ALL personnel involved in the project paid with 2nd party funds, and not simply totals per group"]
[]
[null,{"$f":"L31","v":0}]
["Project","Institution/\nFunding Agency","Research Group","Funding Category","Cost Type","Name ","Internal Reference/ Personnel Number","Function (of the Personnel)","Base Salary / Cost 2017","% for SysX.ch  2017","Number of months employed","Total CHF 2017","Comments"]
[{"$f":"E2","v":0},null,null,"2nd Party ","Personnel",{"$nulls":6},{"$f":"I8*J8/12*K8","v":0}]
[{"$f":"A8","v":0},null,null,"2nd Party ","Personnel",{"$nulls":6},0]
[{"$f":"A9","v":0},null,null,"2nd Party ","Personnel",{"$nulls":6},0]
[0,null,null,"2nd Party ","Personnel",{"$nulls":6},0]
[0,null,null,"2nd Party ","Personnel",{"$nulls":6},0]
[0,null,null,"2nd Party ","Personnel",{"$nulls":6},0]
[0,null,null,"2nd Party ","Personnel",{"$nulls":6},0]
[0,null,null,"2nd Party ","Personnel",{"$nulls":6},0]
[0,null,null,"2nd Party ","Personnel",{"$nulls":6},0]
[0,null,null,"2nd Party ","Personnel",{"$nulls":6},0]
[0,null,null,"2nd Party ","Personnel",{"$nulls":6},0]
[0,null,null,"2nd Party ","Personnel",{"$nulls":6},0]
[0,null,null,"2nd Party ","Personnel",{"$nulls":6},0]
{"$rows_left_out":12}
{"sheet":"2nd Party Equip. & Cons. & Misc","index":10,"n_rows":22,"n_cols":9,"rows_kept":22,"merged":[[3,0,3,2]]}
[]
["Second-Party Funds",null,"Project Titel:",{"$f":"Consolidation!F5","v":0}]
["(e.g. SNSF, CTI, EU, NIH)",null,"SystX.ch int.ref.:",{"$f":"Consolidation!F14","v":0}]
["Equipment, consumables, miscellaneous"]
[]
[null,{"$f":"H22","v":{"v":0,"d":"0.00"}}]
[]
["Please, send a copy of the contract(s) between your institution and the second-party to SystemsX.ch."]
[]
[{"$nulls":6},"to be delivered by the (co-)PI"]
["Funding Agency","Project Title","Duration (from … to ...)","Research Group (PI)","Total approved funds","Funds Used in 2017","% eligible for  SysX.ch Proj","CHF 2nd Party Funds 2017","Remark, Note"]
[{"$nulls":7},{"$f":"G12*F12","v":{"v":0,"d":"0.00"}}]
[{"$nulls":7},{"$f":"G13*F13","v":{"v":0,"d":"0.00"}}]
[{"$nulls":7},{"v":0,"d":"0.00"}]
[{"$nulls":7},{"v":0,"d":"0.00"}]
[{"$nulls":7},{"v":0,"d":"0.00"}]
[{"$nulls":7},{"v":0,"d":"0.00"}]
[{"$nulls":7},{"v":0,"d":"0.00"}]
[{"$nulls":7},{"v":0,"d":"0.00"}]
[{"$nulls":7},{"v":0,"d":"0.00"}]
{"$rows_left_out":3}
{"sheet":"3rd Party Pers.","index":11,"n_rows":31,"n_cols":13,"rows_kept":31,"merged":[[1,4,1,7],[2,0,2,2],[3,0,3,6]]}
[]
["Third-Party Funds",null,null,"Project Titel:",{"$f":"Consolidation!F5","v":0}]
["Personnel",null,null,"SystX.ch int.ref.:",{"$f":"Consolidation!F14","v":0}]
["Please provide details for ALL personnel involved in the project paid with 3rd party funds, and not simply totals per group"]
[]
[null,{"$f":"L31","v":0}]
["Project","Institution/\nFunding Agency","Research Group","Funding Category","Cost Type","Name ","Internal Reference/ Personnel Number","Function (of the Personnel)","Base Salary / Cost 2017","% for SysX.ch  2017","Number of months employed","Total CHF 2017","Comments"]
[{"$f":"E2","v":0},null,null,"3rd Party ","Personnel",{"$nulls":6},{"$f":"I8*J8/12*K8","v":0}]
[{"$f":"A8","v":0},null,null,"3rd Party ","Personnel",{"$nulls":6},0]
[{"$f":"A9","v":0},null,null,"3rd Party ","Personnel",{"$nulls":6},0]
[0,null,null,"3rd Party ","Personnel",{"$nulls":6},0]
[0,null,null,"3rd Party ","Personnel",{"$nulls":6},0]
[0,null,null,"3rd Party ","Personnel",{"$nulls":6},0]
[0,null,null,"3rd Party ","Personnel",{"$nulls":6},0]
[0,null,null,"3rd Party ","Personnel",{"$nulls":6},0]
[0,null,null,"3rd Party ","Personnel",{"$nulls":6},0]
[0,null,null,"3rd Party ","Personnel",{"$nulls":6},0]
[0,null,null,"3rd Party ","Personnel",{"$nulls":6},0]
[0,null,null,"3rd Party ","Personnel",{"$nulls":6},0]
[0,null,null,"3rd Party ","Personnel",{"$nulls":6},0]
{"$rows_left_out":12}
{"sheet":"3rd Party Equip. & Cons. & Misc","index":12,"n_rows":22,"n_cols":9,"rows_kept":22,"merged":[[3,0,3,2]]}
[]
["Third-Party Funds",null,"Project Titel:",{"$f":"Consolidation!F5","v":0}]
["(e.g. industry, SME)",null,"SystX.ch int.ref.:",{"$f":"Consolidation!F14","v":0}]
["Equipment, consumables, miscellaneous"]
[]
[null,{"$f":"H22","v":{"v":0,"d":"0.00"}}]
[]
["Please, send a copy of the contract(s) between your institution and the thrid-party to SystemsX.ch."]
[]
[{"$nulls":6},"to be delivered by the (co-)PI"]
["Funding Agency","Project Title","Duration (from … to ...)","Research Group (PI)","Total approved funds","Funds Used in 2017","% eligible for  SysX.ch Proj","CHF 3rd Party Funds 2017","Remark, Note"]
[{"$nulls":7},{"$f":"G12*F12","v":{"v":0,"d":"0.00"}}]
[{"$nulls":7},{"$f":"G13*F13","v":{"v":0,"d":"0.00"}}]
[{"$nulls":7},{"v":0,"d":"0.00"}]
[{"$nulls":7},{"v":0,"d":"0.00"}]
[{"$nulls":7},{"v":0,"d":"0.00"}]
[{"$nulls":7},{"v":0,"d":"0.00"}]
[{"$nulls":7},{"v":0,"d":"0.00"}]
[{"$nulls":7},{"v":0,"d":"0.00"}]
[{"$nulls":7},{"v":0,"d":"0.00"}]
{"$rows_left_out":3}
{"sheet":"Tables","index":13,"n_rows":43,"n_cols":6,"rows_kept":43}
["Function:","CHF"]
["Professor",{"v":270000,"d":"270,000"}]
["Assistant Professor",{"v":200000,"d":"200,000"}]
["Senior Researcher",{"v":170000,"d":"170,000"}]
["PostDoc",{"v":130000,"d":"130,000"}]
["Technician",{"v":130000,"d":"130,000"}]
["PhD student",{"v":60000,"d":"60,000"}]
["Scientific Assistant",{"v":110000,"d":"110,000"}]
["Admin/ Misc.",{"v":90000,"d":"90,000"}]
[]
["Institute",null,"Cost Category",null,"Type","Type2"]
["EPFL",null,"SystemsX.ch",null,null,"Equipment"]
["ETHZ",null,"Own Contributions",null,"Consumables","Exist. Infrastr."]
["FMI",{"$nulls":3},"Miscellaneous"]
["IBM Research"]
["KantSpit_SG"]
["PSI"]
["SIB",{"$nulls":3},"Type3","Type4"]
["UniBE",{"$nulls":3},"OC Personnel","Consumables"]
["UniBS",{"$nulls":4},"Miscellaneous"]
{"$rows_left_out":23}